COMMAND: ./gradlew --offline --no-daemon --console=plain test --tests example.tasks.TaskServerLifecycleTest installDist packageTest
To honour the JVM settings for this build a single-use Daemon process will be forked. For more on this, please refer to https://docs.gradle.org/8.14/userguide/gradle_daemon.html#sec:disabling_the_daemon in the Gradle documentation.
Daemon will be stopped at the end of the build 
> Task :checkKotlinGradlePluginConfigurationErrors SKIPPED
> Task :domain:checkKotlinGradlePluginConfigurationErrors SKIPPED
> Task :domain:compileKotlin UP-TO-DATE
> Task :domain:compileJava NO-SOURCE
> Task :domain:processResources NO-SOURCE
> Task :domain:classes UP-TO-DATE
> Task :domain:jar UP-TO-DATE
> Task :processResources NO-SOURCE
> Task :processTestResources NO-SOURCE
> Task :domain:compileTestKotlin NO-SOURCE
> Task :domain:compileTestJava NO-SOURCE
> Task :domain:processTestResources NO-SOURCE
> Task :domain:testClasses UP-TO-DATE
> Task :domain:test NO-SOURCE
> Task :compileKotlin
> Task :compileJava UP-TO-DATE
> Task :classes UP-TO-DATE
> Task :jar
> Task :serverStartScripts
> Task :startScripts
> Task :installDist
> Task :compileTestKotlin
> Task :compileTestJava UP-TO-DATE
> Task :testClasses UP-TO-DATE
> Task :test

> Task :packageTest

TaskServerDistributionTest > installedLauncherStopsWorkerAndClosesRealPort() FAILED
    org.opentest4j.AssertionFailedError at TaskServerDistributionTest.kt:45

1 test completed, 1 failed

> Task :packageTest FAILED

FAILURE: Build failed with an exception.

* What went wrong:
Execution failed for task ':packageTest'.
> There were failing tests. See the report at: file:///home/admin/workspace/my-blogs/examples/kotlin-language/build/reports/tests/packageTest/index.html

* Try:
> Run with --scan to get full insights.

BUILD FAILED in 1m 15s
12 actionable tasks: 8 executed, 4 up-to-date
EXIT_CODE=1
