COMMAND: bash -c cd\ \"\$1\"\ \&\&\ ./gradlew\ --offline\ --no-daemon\ --console=plain\ compileKotlin _ /tmp/kotlin-18-rejected-Ut1xrf
To honour the JVM settings for this build a single-use Daemon process will be forked. For more on this, please refer to https://docs.gradle.org/8.14/userguide/gradle_daemon.html#sec:disabling_the_daemon in the Gradle documentation.
Daemon will be stopped at the end of the build 
> Task :checkKotlinGradlePluginConfigurationErrors SKIPPED

> Task :compileKotlin
e: file:///tmp/kotlin-18-rejected-Ut1xrf/src/main/kotlin/18-invalid-annotation-target.kt:3:1 This annotation is not applicable to target 'top level function'. Applicable targets: class

> Task :compileKotlin FAILED

FAILURE: Build failed with an exception.

* What went wrong:
Execution failed for task ':compileKotlin'.
> A failure occurred while executing org.jetbrains.kotlin.compilerRunner.GradleCompilerRunnerWithWorkers$GradleKotlinCompilerWorkAction
   > Compilation error. See log for more details

* Try:
> Run with --stacktrace option to get the stack trace.
> Run with --info or --debug option to get more log output.
> Run with --scan to get full insights.
> Get more help at https://help.gradle.org.

BUILD FAILED in 18s
1 actionable task: 1 executed
EXIT_CODE=1
