UTC_DATE=2026-10-09T12:58:31+00:00
COMMAND: stage full Kotlin workspace, VERSIONS/research/verification; SHA; extract; offline clean test and CLI
STAGING=/tmp/kotlin-30-stage-yctDkB
REPLAY=/tmp/kotlin-30-unpack-JNJZ1y
STAGE_EXIT_CODE=0
COPY_EXIT_CODE=0
ARCHIVE_EXIT_CODE=0
kotlin-language-30.tar.gz: OK
SHA_EXIT_CODE=0
kotlin-language/verification/30.sh
kotlin-language/src/test/kotlin/example/tasks/BoundedTaskQueueTest.kt
kotlin-language/gradlew
kotlin-language/gradle/wrapper/gradle-wrapper.jar
kotlin-language/gradlew.bat
kotlin-language/RUN.md
VERSIONS.md
verification/30/
verification/30/BlockingTaskStepTest.txt
verification/30/style.txt
verification/30/assertions.txt
verification/30/OptionalTaskNoteTest.txt
verification/30/TaskStoreTest.txt
verification/30/unpack.txt
verification/30/TaskLabelPipelineTest.txt
verification/30/CancellableTaskRunTest.txt
verification/30/bytecode.txt
verification/30/TaskQueryTest.txt
verification/30/TaskDraftTest.txt
UNPACK_EXIT_CODE=0
To honour the JVM settings for this build a single-use Daemon process will be forked. For more on this, please refer to https://docs.gradle.org/8.14/userguide/gradle_daemon.html#sec:disabling_the_daemon in the Gradle documentation.
Daemon will be stopped at the end of the build 
> Task :clean UP-TO-DATE
> Task :domain:clean UP-TO-DATE
> Task :checkKotlinGradlePluginConfigurationErrors SKIPPED
> Task :domain:checkKotlinGradlePluginConfigurationErrors SKIPPED
> Task :domain:processResources NO-SOURCE
> Task :processResources NO-SOURCE
> Task :processTestResources NO-SOURCE
> Task :domain:processTestResources NO-SOURCE
> Task :domain:compileKotlin
> Task :domain:compileJava NO-SOURCE
> Task :domain:classes UP-TO-DATE
> Task :domain:jar
> Task :domain:compileTestKotlin NO-SOURCE
> Task :domain:compileTestJava NO-SOURCE
> Task :domain:testClasses UP-TO-DATE
> Task :domain:test NO-SOURCE
> Task :compileKotlin
> Task :compileJava
> Task :classes
> Task :jar

> Task :compileTestKotlin
w: file:///tmp/kotlin-30-unpack-JNJZ1y/kotlin-language/src/test/kotlin/example/tasks/TaskFormattingTest.kt:19:20 This extension is shadowed by a member: 'fun label(): String'.

> Task :compileTestJava
> Task :testClasses
> Task :test

BUILD SUCCESSFUL in 1m 20s
10 actionable tasks: 8 executed, 2 up-to-date
TEST_EXIT_CODE=0
To honour the JVM settings for this build a single-use Daemon process will be forked. For more on this, please refer to https://docs.gradle.org/8.14/userguide/gradle_daemon.html#sec:disabling_the_daemon in the Gradle documentation.
Daemon will be stopped at the end of the build 
> Task :checkKotlinGradlePluginConfigurationErrors SKIPPED
> Task :domain:checkKotlinGradlePluginConfigurationErrors SKIPPED
> Task :domain:compileKotlin UP-TO-DATE
> Task :domain:compileJava NO-SOURCE
> Task :domain:processResources NO-SOURCE
> Task :domain:classes UP-TO-DATE
> Task :domain:jar UP-TO-DATE
> Task :compileKotlin UP-TO-DATE
> Task :compileJava UP-TO-DATE
> Task :processResources NO-SOURCE
> Task :classes UP-TO-DATE

> Task :run
TASK input accepted (not persisted): alpha

BUILD SUCCESSFUL in 25s
5 actionable tasks: 1 executed, 4 up-to-date
VALID_EXIT_CODE=0
To honour the JVM settings for this build a single-use Daemon process will be forked. For more on this, please refer to https://docs.gradle.org/8.14/userguide/gradle_daemon.html#sec:disabling_the_daemon in the Gradle documentation.
Daemon will be stopped at the end of the build 
> Task :checkKotlinGradlePluginConfigurationErrors SKIPPED
> Task :domain:checkKotlinGradlePluginConfigurationErrors SKIPPED
> Task :domain:compileKotlin UP-TO-DATE
> Task :domain:compileJava NO-SOURCE
> Task :domain:processResources NO-SOURCE
> Task :domain:classes UP-TO-DATE
> Task :domain:jar UP-TO-DATE
> Task :compileKotlin UP-TO-DATE
> Task :compileJava UP-TO-DATE
> Task :processResources NO-SOURCE
> Task :classes UP-TO-DATE

> Task :run FAILED
Exception in thread "main" java.lang.IllegalArgumentException: Usage: submit <task text>
	at example.tasks.MainKt.submitTask(Main.kt:4)
	at example.tasks.CommandParserKt.parseCommand(CommandParser.kt:5)
	at example.tasks.MainKt.main(Main.kt:11)

FAILURE: Build failed with an exception.

* What went wrong:
Execution failed for task ':run'.
> Process 'command '/usr/lib/jvm/java-21-openjdk-amd64/bin/java'' finished with non-zero exit value 1

* Try:
> Run with --stacktrace option to get the stack trace.
> Run with --info or --debug option to get more log output.
> Run with --scan to get full insights.
> Get more help at https://help.gradle.org.

BUILD FAILED in 19s
5 actionable tasks: 1 executed, 4 up-to-date
INVALID_EXIT_CODE=1
