UTC_DATE=2026-10-09T08:24:59+00:00
STAGING=/tmp/kotlin-21-stage-7P6WcP
REPLAY=/tmp/kotlin-21-unpack-X9AAOC
COMMAND: tar -C examples --exclude build --exclude .gradle --exclude .kotlin -cf - kotlin-language | tar -C STAGING -xf -
STAGE_EXIT_CODE=0
COMMAND: cp VERSIONS.md, research and verification into STAGING
COPY_EXIT_CODE=0
COMMAND: tar -C STAGING -czf kotlin-language-21.tar.gz kotlin-language VERSIONS.md research verification
ARCHIVE_EXIT_CODE=0
kotlin-language-21.tar.gz: OK
SHA_EXIT_CODE=0
COMMAND: inspect archive members
kotlin-language/verification/21.sh
kotlin-language/src/test/kotlin/example/tasks/ModuleBoundaryTest.kt
kotlin-language/gradlew
kotlin-language/gradle/wrapper/gradle-wrapper.jar
kotlin-language/RUN.md
kotlin-language/domain/build.gradle.kts
kotlin-language/domain/src/main/kotlin/example/tasks/TaskState.kt
kotlin-language/domain/src/main/kotlin/example/tasks/TaskRecord.kt
kotlin-language/domain/src/main/kotlin/example/tasks/TaskStore.kt
VERSIONS.md
verification/21/style.txt
verification/21/assertions.txt
COMMAND: tar -xzf kotlin-language-21.tar.gz -C REPLAY
UNPACK_EXIT_CODE=0
COMMAND: (cd REPLAY/kotlin-language && ./gradlew --offline --no-daemon --console=plain clean test)
To honour the JVM settings for this build a single-use Daemon process will be forked. For more on this, please refer to https://docs.gradle.org/8.14/userguide/gradle_daemon.html#sec:disabling_the_daemon in the Gradle documentation.
Daemon will be stopped at the end of the build 
> Task :clean UP-TO-DATE
> Task :domain:clean UP-TO-DATE
> Task :checkKotlinGradlePluginConfigurationErrors SKIPPED
> Task :domain:checkKotlinGradlePluginConfigurationErrors SKIPPED
> Task :domain:processResources NO-SOURCE
> Task :processResources NO-SOURCE
> Task :processTestResources NO-SOURCE
> Task :domain:processTestResources NO-SOURCE
> Task :domain:compileKotlin
> Task :domain:compileJava NO-SOURCE
> Task :domain:classes UP-TO-DATE
> Task :domain:jar
> Task :domain:compileTestKotlin NO-SOURCE
> Task :domain:compileTestJava NO-SOURCE
> Task :domain:testClasses UP-TO-DATE
> Task :domain:test NO-SOURCE
> Task :compileKotlin
> Task :compileJava
> Task :classes
> Task :jar

> Task :compileTestKotlin
w: file:///tmp/kotlin-21-unpack-X9AAOC/kotlin-language/src/test/kotlin/example/tasks/TaskFormattingTest.kt:19:20 This extension is shadowed by a member: 'fun label(): String'.

> Task :compileTestJava
> Task :testClasses
> Task :test

BUILD SUCCESSFUL in 56s
10 actionable tasks: 8 executed, 2 up-to-date
TEST_EXIT_CODE=0
COMMAND: (cd REPLAY/kotlin-language && ./gradlew --offline --no-daemon --console=plain run --args="submit alpha")
To honour the JVM settings for this build a single-use Daemon process will be forked. For more on this, please refer to https://docs.gradle.org/8.14/userguide/gradle_daemon.html#sec:disabling_the_daemon in the Gradle documentation.
Daemon will be stopped at the end of the build 
> Task :checkKotlinGradlePluginConfigurationErrors SKIPPED
> Task :domain:checkKotlinGradlePluginConfigurationErrors SKIPPED
> Task :domain:compileKotlin UP-TO-DATE
> Task :domain:compileJava NO-SOURCE
> Task :domain:processResources NO-SOURCE
> Task :domain:classes UP-TO-DATE
> Task :domain:jar UP-TO-DATE
> Task :compileKotlin UP-TO-DATE
> Task :compileJava UP-TO-DATE
> Task :processResources NO-SOURCE
> Task :classes UP-TO-DATE

> Task :run
TASK input accepted (not persisted): alpha

BUILD SUCCESSFUL in 26s
5 actionable tasks: 1 executed, 4 up-to-date
VALID_EXIT_CODE=0
COMMAND: (cd REPLAY/kotlin-language && ./gradlew --offline --no-daemon --console=plain run --args=submit)
To honour the JVM settings for this build a single-use Daemon process will be forked. For more on this, please refer to https://docs.gradle.org/8.14/userguide/gradle_daemon.html#sec:disabling_the_daemon in the Gradle documentation.
Daemon will be stopped at the end of the build 
> Task :checkKotlinGradlePluginConfigurationErrors SKIPPED
> Task :domain:checkKotlinGradlePluginConfigurationErrors SKIPPED
> Task :domain:compileKotlin UP-TO-DATE
> Task :domain:compileJava NO-SOURCE
> Task :domain:processResources NO-SOURCE
> Task :domain:classes UP-TO-DATE
> Task :domain:jar UP-TO-DATE
> Task :compileKotlin UP-TO-DATE
> Task :compileJava UP-TO-DATE
> Task :processResources NO-SOURCE
> Task :classes UP-TO-DATE

> Task :run FAILED
Exception in thread "main" java.lang.IllegalArgumentException: Usage: submit <task text>
	at example.tasks.MainKt.submitTask(Main.kt:4)
	at example.tasks.CommandParserKt.parseCommand(CommandParser.kt:5)
	at example.tasks.MainKt.main(Main.kt:11)

FAILURE: Build failed with an exception.

* What went wrong:
Execution failed for task ':run'.
> Process 'command '/usr/lib/jvm/java-21-openjdk-amd64/bin/java'' finished with non-zero exit value 1

* Try:
> Run with --stacktrace option to get the stack trace.
> Run with --info or --debug option to get more log output.
> Run with --scan to get full insights.
> Get more help at https://help.gradle.org.

BUILD FAILED in 28s
5 actionable tasks: 1 executed, 4 up-to-date
INVALID_EXIT_CODE=1
COMMAND: inspect twenty-two unpacked JUnit XML suite results
CommandParserTest tests="2" skipped="0" failures="0" errors="0"
JavaInputBoundaryTest tests="2" skipped="0" failures="0" errors="0"
MainTest tests="2" skipped="0" failures="0" errors="0"
ModuleBoundaryTest tests="2" skipped="0" failures="0" errors="0"
OptionalTaskNoteTest tests="2" skipped="0" failures="0" errors="0"
SubmissionDecisionTest tests="2" skipped="0" failures="0" errors="0"
TaskDraftTest tests="2" skipped="0" failures="0" errors="0"
TaskFormattingTest tests="2" skipped="0" failures="0" errors="0"
TaskJavaApiConsumerTest tests="2" skipped="0" failures="0" errors="0"
TaskLabelPipelineTest tests="2" skipped="0" failures="0" errors="0"
TaskLabelRulesTest tests="2" skipped="0" failures="0" errors="0"
TaskMetadataTest tests="2" skipped="0" failures="0" errors="0"
TaskProposalTest tests="2" skipped="0" failures="0" errors="0"
TaskQueryTest tests="2" skipped="0" failures="0" errors="0"
TaskRecordTest tests="2" skipped="0" failures="0" errors="0"
TaskSettingsTest tests="2" skipped="0" failures="0" errors="0"
TaskStatePortsTest tests="2" skipped="0" failures="0" errors="0"
TaskStateTest tests="2" skipped="0" failures="0" errors="0"
TaskStoreTest tests="2" skipped="0" failures="0" errors="0"
TaskTest tests="2" skipped="0" failures="0" errors="0"
TaskTextTest tests="2" skipped="0" failures="0" errors="0"
TypedTaskIdTest tests="2" skipped="0" failures="0" errors="0"
SUITE_COUNT=22
ALL_REPLAY_COMMANDS_COMPLETE=1
