UTC_DATE=2026-10-09T07:02:23+00:00
STAGING=/tmp/kotlin-15-stage-rZJnwZ
REPLAY=/tmp/kotlin-15-unpack-N9xImi
COMMAND: tar -C examples --exclude build --exclude .gradle --exclude .kotlin -cf - kotlin-language | tar -C STAGING -xf -
STAGE_EXIT_CODE=0
COPY_EXIT_CODE=0
COMMAND: tar -C STAGING -czf kotlin-language-15.tar.gz kotlin-language VERSIONS.md research verification
ARCHIVE_EXIT_CODE=0
kotlin-language-15.tar.gz: OK
SHA_EXIT_CODE=0
COMMAND: inspect archive members
kotlin-language/verification/15-invalid-generic-checks.kt
kotlin-language/src/test/kotlin/example/tasks/TaskStatePortsTest.kt
kotlin-language/src/main/kotlin/example/tasks/TaskStatePorts.kt
kotlin-language/gradlew
kotlin-language/gradle/wrapper/gradle-wrapper.jar
kotlin-language/RUN.md
VERSIONS.md
verification/15/style.txt
verification/15/assertions.txt
verification/15/rejected.txt
COMMAND: tar -xzf kotlin-language-15.tar.gz -C REPLAY
UNPACK_EXIT_CODE=0
COMMAND: (cd REPLAY/kotlin-language && ./gradlew --offline --no-daemon --console=plain clean test)
To honour the JVM settings for this build a single-use Daemon process will be forked. For more on this, please refer to https://docs.gradle.org/8.14/userguide/gradle_daemon.html#sec:disabling_the_daemon in the Gradle documentation.
Daemon will be stopped at the end of the build 
> Task :clean UP-TO-DATE
> Task :checkKotlinGradlePluginConfigurationErrors SKIPPED
> Task :processResources NO-SOURCE
> Task :processTestResources NO-SOURCE
> Task :compileKotlin
> Task :compileJava NO-SOURCE
> Task :classes UP-TO-DATE
> Task :jar

> Task :compileTestKotlin
w: file:///tmp/kotlin-15-unpack-N9xImi/kotlin-language/src/test/kotlin/example/tasks/TaskFormattingTest.kt:19:20 This extension is shadowed by a member: 'fun label(): String'.

> Task :compileTestJava NO-SOURCE
> Task :testClasses UP-TO-DATE
> Task :test

BUILD SUCCESSFUL in 47s
5 actionable tasks: 4 executed, 1 up-to-date
TEST_EXIT_CODE=0
COMMAND: (cd REPLAY/kotlin-language && ./gradlew --offline --no-daemon --console=plain run --args="submit alpha")
To honour the JVM settings for this build a single-use Daemon process will be forked. For more on this, please refer to https://docs.gradle.org/8.14/userguide/gradle_daemon.html#sec:disabling_the_daemon in the Gradle documentation.
Daemon will be stopped at the end of the build 
> Task :checkKotlinGradlePluginConfigurationErrors SKIPPED
> Task :compileKotlin UP-TO-DATE
> Task :compileJava NO-SOURCE
> Task :processResources NO-SOURCE
> Task :classes UP-TO-DATE

> Task :run
TASK input accepted (not persisted): alpha

BUILD SUCCESSFUL in 26s
2 actionable tasks: 1 executed, 1 up-to-date
VALID_EXIT_CODE=0
COMMAND: (cd REPLAY/kotlin-language && ./gradlew --offline --no-daemon --console=plain run --args=submit)
To honour the JVM settings for this build a single-use Daemon process will be forked. For more on this, please refer to https://docs.gradle.org/8.14/userguide/gradle_daemon.html#sec:disabling_the_daemon in the Gradle documentation.
Daemon will be stopped at the end of the build 
> Task :checkKotlinGradlePluginConfigurationErrors SKIPPED
> Task :compileKotlin UP-TO-DATE
> Task :compileJava NO-SOURCE
> Task :processResources NO-SOURCE
> Task :classes UP-TO-DATE

> Task :run FAILED
Exception in thread "main" java.lang.IllegalArgumentException: Usage: submit <task text>
	at example.tasks.MainKt.submitTask(Main.kt:4)
	at example.tasks.CommandParserKt.parseCommand(CommandParser.kt:5)
	at example.tasks.MainKt.main(Main.kt:11)

FAILURE: Build failed with an exception.

* What went wrong:
Execution failed for task ':run'.
> Process 'command '/usr/lib/jvm/java-21-openjdk-amd64/bin/java'' finished with non-zero exit value 1

* Try:
> Run with --stacktrace option to get the stack trace.
> Run with --info or --debug option to get more log output.
> Run with --scan to get full insights.
> Get more help at https://help.gradle.org.

BUILD FAILED in 23s
2 actionable tasks: 1 executed, 1 up-to-date
INVALID_EXIT_CODE=1
COMMAND: inspect unpacked sixteen JUnit XML suite results
example.tasks.CommandParserTest tests=2 skipped=0 failures=0 errors=0
example.tasks.MainTest tests=2 skipped=0 failures=0 errors=0
example.tasks.OptionalTaskNoteTest tests=2 skipped=0 failures=0 errors=0
example.tasks.SubmissionDecisionTest tests=2 skipped=0 failures=0 errors=0
example.tasks.TaskFormattingTest tests=2 skipped=0 failures=0 errors=0
example.tasks.TaskLabelPipelineTest tests=2 skipped=0 failures=0 errors=0
example.tasks.TaskLabelRulesTest tests=2 skipped=0 failures=0 errors=0
example.tasks.TaskProposalTest tests=2 skipped=0 failures=0 errors=0
example.tasks.TaskQueryTest tests=2 skipped=0 failures=0 errors=0
example.tasks.TaskRecordTest tests=2 skipped=0 failures=0 errors=0
example.tasks.TaskSettingsTest tests=2 skipped=0 failures=0 errors=0
example.tasks.TaskStatePortsTest tests=2 skipped=0 failures=0 errors=0
example.tasks.TaskStateTest tests=2 skipped=0 failures=0 errors=0
example.tasks.TaskStoreTest tests=2 skipped=0 failures=0 errors=0
example.tasks.TaskTest tests=2 skipped=0 failures=0 errors=0
example.tasks.TaskTextTest tests=2 skipped=0 failures=0 errors=0
ALL_REPLAY_COMMANDS_COMPLETE=1
