UTC_DATE=2026-10-08T05:15:29+00:00
STAGING=/tmp/kotlin-09-stage-5p03L4
REPLAY=/tmp/kotlin-09-unpack-GTOKn7
COMMAND: tar -C examples --exclude build --exclude .gradle --exclude .kotlin -cf - kotlin-language | tar -C STAGING -xf -
STAGE_EXIT_CODE=0
COMMAND: cp VERSIONS.md and research/00-09 verification/00-09 to staging
COMMAND: tar -C STAGING -czf kotlin-language-09.tar.gz kotlin-language VERSIONS.md research verification
ARCHIVE_EXIT_CODE=0
COMMAND: sha256sum kotlin-language-09.tar.gz > kotlin-language-09.tar.gz.sha256; sha256sum -c
kotlin-language-09.tar.gz: OK
SHA_EXIT_CODE=0
COMMAND: tar -tzf kotlin-language-09.tar.gz | verify required files
kotlin-language/src/test/kotlin/example/tasks/TaskTest.kt
kotlin-language/src/main/kotlin/example/tasks/Task.kt
kotlin-language/gradlew
kotlin-language/gradle/wrapper/gradle-wrapper.jar
kotlin-language/RUN.md
VERSIONS.md
verification/09/style.txt
verification/09/assertions.txt
COMMAND: tar -xzf kotlin-language-09.tar.gz -C REPLAY
UNPACK_EXIT_CODE=0
COMMAND: (cd REPLAY/kotlin-language && ./gradlew --offline --no-daemon --console=plain clean test)
To honour the JVM settings for this build a single-use Daemon process will be forked. For more on this, please refer to https://docs.gradle.org/8.14/userguide/gradle_daemon.html#sec:disabling_the_daemon in the Gradle documentation.
Daemon will be stopped at the end of the build 
> Task :clean UP-TO-DATE
> Task :checkKotlinGradlePluginConfigurationErrors SKIPPED
> Task :processResources NO-SOURCE
> Task :processTestResources NO-SOURCE
> Task :compileKotlin
> Task :compileJava NO-SOURCE
> Task :classes UP-TO-DATE
> Task :jar
> Task :compileTestKotlin
> Task :compileTestJava NO-SOURCE
> Task :testClasses UP-TO-DATE
> Task :test

BUILD SUCCESSFUL in 36s
5 actionable tasks: 4 executed, 1 up-to-date
REPLAY_CLEAN_TEST_EXIT_CODE=0
COMMAND: (cd REPLAY/kotlin-language && ./gradlew --offline --no-daemon --console=plain run --args="submit alpha")
To honour the JVM settings for this build a single-use Daemon process will be forked. For more on this, please refer to https://docs.gradle.org/8.14/userguide/gradle_daemon.html#sec:disabling_the_daemon in the Gradle documentation.
Daemon will be stopped at the end of the build 
> Task :checkKotlinGradlePluginConfigurationErrors SKIPPED
> Task :compileKotlin UP-TO-DATE
> Task :compileJava NO-SOURCE
> Task :processResources NO-SOURCE
> Task :classes UP-TO-DATE

> Task :run
TASK input accepted (not persisted): alpha

BUILD SUCCESSFUL in 18s
2 actionable tasks: 1 executed, 1 up-to-date
REPLAY_VALID_EXIT_CODE=0
COMMAND: (cd REPLAY/kotlin-language && ./gradlew --offline --no-daemon --console=plain run --args=submit)
To honour the JVM settings for this build a single-use Daemon process will be forked. For more on this, please refer to https://docs.gradle.org/8.14/userguide/gradle_daemon.html#sec:disabling_the_daemon in the Gradle documentation.
Daemon will be stopped at the end of the build 
> Task :checkKotlinGradlePluginConfigurationErrors SKIPPED
> Task :compileKotlin UP-TO-DATE
> Task :compileJava NO-SOURCE
> Task :processResources NO-SOURCE
> Task :classes UP-TO-DATE

> Task :run FAILED
Exception in thread "main" java.lang.IllegalArgumentException: Usage: submit <task text>
	at example.tasks.MainKt.submitTask(Main.kt:4)
	at example.tasks.CommandParserKt.parseCommand(CommandParser.kt:5)
	at example.tasks.MainKt.main(Main.kt:11)

FAILURE: Build failed with an exception.

* What went wrong:
Execution failed for task ':run'.
> Process 'command '/usr/lib/jvm/java-21-openjdk-amd64/bin/java'' finished with non-zero exit value 1

* Try:
> Run with --stacktrace option to get the stack trace.
> Run with --info or --debug option to get more log output.
> Run with --scan to get full insights.
> Get more help at https://help.gradle.org.

BUILD FAILED in 22s
2 actionable tasks: 1 executed, 1 up-to-date
REPLAY_INVALID_EXIT_CODE=1
COMMAND: inspect ten unpacked JUnit suite XML files
REPLAY_SUITES_PASS=10
REPLAY_ASSERTIONS=PASS
