COMMAND: bash -c cd\ \"\$1\"\ \&\&\ ./gradlew\ --offline\ --no-daemon\ --console=plain\ compileKotlin _ /tmp/kotlin-03-rejected-xIxNWz
To honour the JVM settings for this build a single-use Daemon process will be forked. For more on this, please refer to https://docs.gradle.org/8.14/userguide/gradle_daemon.html#sec:disabling_the_daemon in the Gradle documentation.
Daemon will be stopped at the end of the build 
> Task :checkKotlinGradlePluginConfigurationErrors SKIPPED

> Task :compileKotlin
e: file:///tmp/kotlin-03-rejected-xIxNWz/src/main/kotlin/03-java-named-args.kt:3:54 None of the following candidates is applicable:
static fun max(p0: Int, p1: Int): Int
static fun max(p0: Long, p1: Long): Long
static fun max(p0: Float, p1: Float): Float
static fun max(p0: Double, p1: Double): Double

> Task :compileKotlin FAILED

FAILURE: Build failed with an exception.

* What went wrong:
Execution failed for task ':compileKotlin'.
> A failure occurred while executing org.jetbrains.kotlin.compilerRunner.GradleCompilerRunnerWithWorkers$GradleKotlinCompilerWorkAction
   > Compilation error. See log for more details

* Try:
> Run with --stacktrace option to get the stack trace.
> Run with --info or --debug option to get more log output.
> Run with --scan to get full insights.
> Get more help at https://help.gradle.org.

BUILD FAILED in 25s
1 actionable task: 1 executed
EXIT_CODE=1
